Target
Bifunctional dihydrofolate reductase-thymidylate synthase
Ligand
BDBM50067869
Substrate
Meas. Tech.
ChEMBL_53458 (CHEMBL661508)
IC50
15±n/a nM
Citation
 Gangjee, AZhu, YQueener, SF 6-Substituted 2,4-diaminopyrido[3,2-d]pyrimidine analogues of piritrexim as inhibitors of dihydrofolate reductase from rat liver, Pneumocystis carinii, and Toxoplasma gondii and as antitumor agents. J Med Chem 41:4533-41 (1998)  
Target
Name:
Bifunctional dihydrofolate reductase-thymidylate synthase
Synonyms:
DHFR-TS Dihydrofolate reductase Dihydrofolate reductase; T. gondii vs rat
Type:
Enzyme
Mol. Mass.:
68757.49
Organism:
Toxoplasma gondii
Description:
Q07422
Residue:
610
  
Inhibitor
Name:
BDBM50067869
Synonyms:
CHEMBL139430 | N*6*-Methyl-N*6*-naphthalen-2-yl-pyrido[3,2-d]pyrimidine-2,4,6-triamine
Type:
Small organic molecule
Emp. Form.:
C18H16N6
Mol. Mass.:
316.3598
SMILES:
CN(c1ccc2ccccc2c1)c1ccc2nc(N)nc(N)c2n1
: