Target
Bifunctional dihydrofolate reductase-thymidylate synthase
Ligand
BDBM50067856
Substrate
Meas. Tech.
ChEMBL_53457 (CHEMBL661507)
IC50
45±n/a nM
Citation
 Gangjee, AZhu, YQueener, SF 6-Substituted 2,4-diaminopyrido[3,2-d]pyrimidine analogues of piritrexim as inhibitors of dihydrofolate reductase from rat liver, Pneumocystis carinii, and Toxoplasma gondii and as antitumor agents. J Med Chem 41:4533-41 (1998)  
Target
Name:
Bifunctional dihydrofolate reductase-thymidylate synthase
Synonyms:
DHFR-TS Dihydrofolate reductase Dihydrofolate reductase; T. gondii vs rat
Type:
Enzyme
Mol. Mass.:
68757.49
Organism:
Toxoplasma gondii
Description:
Q07422
Residue:
610
  
Inhibitor
Name:
BDBM50067856
Synonyms:
6-(4-Methoxy-phenylsulfanyl)-pyrido[3,2-d]pyrimidine-2,4-diamine | CHEMBL137844
Type:
Small organic molecule
Emp. Form.:
C14H13N5OS
Mol. Mass.:
299.351
SMILES:
COc1ccc(Sc2ccc3nc(N)nc(N)c3n2)cc1
: