Target
Dihydrofolate reductase
Ligand
BDBM50067858
Substrate
Meas. Tech.
ChEMBL_52974 (CHEMBL664182)
IC50
220±n/a nM
Citation
 Gangjee, AZhu, YQueener, SF 6-Substituted 2,4-diaminopyrido[3,2-d]pyrimidine analogues of piritrexim as inhibitors of dihydrofolate reductase from rat liver, Pneumocystis carinii, and Toxoplasma gondii and as antitumor agents. J Med Chem 41:4533-41 (1998)  
Target
Name:
Dihydrofolate reductase
Synonyms:
DYR_PNECA Dihydrofolate reductase Tetrahydrofolate dehydrogenase
Type:
Enzyme
Mol. Mass.:
23891.29
Organism:
Pneumocystis carinii
Description:
Residue:
206
  
Inhibitor
Name:
BDBM50067858
Synonyms:
CHEMBL141160 | N*6*-(4-Methoxy-phenyl)-N*6*-methyl-pyrido[3,2-d]pyrimidine-2,4,6-triamine
Type:
Small organic molecule
Emp. Form.:
C15H16N6O
Mol. Mass.:
296.3271
SMILES:
COc1ccc(cc1)N(C)c1ccc2nc(N)nc(N)c2n1
: