Target
Bifunctional dihydrofolate reductase-thymidylate synthase
Ligand
BDBM50067857
Substrate
Meas. Tech.
ChEMBL_53457 (CHEMBL661507)
IC50
7.6±n/a nM
Citation
 Gangjee, AZhu, YQueener, SF 6-Substituted 2,4-diaminopyrido[3,2-d]pyrimidine analogues of piritrexim as inhibitors of dihydrofolate reductase from rat liver, Pneumocystis carinii, and Toxoplasma gondii and as antitumor agents. J Med Chem 41:4533-41 (1998)  
Target
Name:
Bifunctional dihydrofolate reductase-thymidylate synthase
Synonyms:
DHFR-TS Dihydrofolate reductase Dihydrofolate reductase; T. gondii vs rat
Type:
Enzyme
Mol. Mass.:
68757.49
Organism:
Toxoplasma gondii
Description:
Q07422
Residue:
610
  
Inhibitor
Name:
BDBM50067857
Synonyms:
CHEMBL139485 | N*6*-Methyl-N*6*-(3,4,5-trimethoxy-phenyl)-pyrido[3,2-d]pyrimidine-2,4,6-triamine
Type:
Small organic molecule
Emp. Form.:
C17H20N6O3
Mol. Mass.:
356.3791
SMILES:
COc1cc(cc(OC)c1OC)N(C)c1ccc2nc(N)nc(N)c2n1
: