Target
Dihydrofolate reductase
Ligand
BDBM50067869
Substrate
Meas. Tech.
ChEMBL_55109 (CHEMBL665436)
IC50
9.9±n/a nM
Citation
 Gangjee, AZhu, YQueener, SF 6-Substituted 2,4-diaminopyrido[3,2-d]pyrimidine analogues of piritrexim as inhibitors of dihydrofolate reductase from rat liver, Pneumocystis carinii, and Toxoplasma gondii and as antitumor agents. J Med Chem 41:4533-41 (1998)  
Target
Name:
Dihydrofolate reductase
Synonyms:
DYR_RAT Dihydrofolate reductase (DHFR) Tetrahydrofolate dehydrogenase
Type:
Enzyme
Mol. Mass.:
21638.84
Organism:
Rattus norvegicus (rat)
Description:
Residue:
187
  
Inhibitor
Name:
BDBM50067869
Synonyms:
CHEMBL139430 | N*6*-Methyl-N*6*-naphthalen-2-yl-pyrido[3,2-d]pyrimidine-2,4,6-triamine
Type:
Small organic molecule
Emp. Form.:
C18H16N6
Mol. Mass.:
316.3598
SMILES:
CN(c1ccc2ccccc2c1)c1ccc2nc(N)nc(N)c2n1
: