Target
Dihydrofolate reductase
Ligand
BDBM50067873
Substrate
Meas. Tech.
ChEMBL_55108 (CHEMBL665435)
IC50
2000±n/a nM
Citation
 Gangjee, AZhu, YQueener, SF 6-Substituted 2,4-diaminopyrido[3,2-d]pyrimidine analogues of piritrexim as inhibitors of dihydrofolate reductase from rat liver, Pneumocystis carinii, and Toxoplasma gondii and as antitumor agents. J Med Chem 41:4533-41 (1998)  
Target
Name:
Dihydrofolate reductase
Synonyms:
DYR_RAT Dihydrofolate reductase (DHFR) Tetrahydrofolate dehydrogenase
Type:
Enzyme
Mol. Mass.:
21638.84
Organism:
Rattus norvegicus (rat)
Description:
Residue:
187
  
Inhibitor
Name:
BDBM50067873
Synonyms:
CHEMBL138419 | N*6*-Naphthalen-2-yl-pyrido[3,2-d]pyrimidine-2,4,6-triamine
Type:
Small organic molecule
Emp. Form.:
C17H14N6
Mol. Mass.:
302.3333
SMILES:
Nc1nc(N)c2nc(Nc3ccc4ccccc4c3)ccc2n1
: