Target
Dihydrofolate reductase
Ligand
BDBM18268
Substrate
Meas. Tech.
ChEMBL_55108 (CHEMBL665435)
IC50
3±n/a nM
Citation
 Gangjee, AZhu, YQueener, SF 6-Substituted 2,4-diaminopyrido[3,2-d]pyrimidine analogues of piritrexim as inhibitors of dihydrofolate reductase from rat liver, Pneumocystis carinii, and Toxoplasma gondii and as antitumor agents. J Med Chem 41:4533-41 (1998)  
Target
Name:
Dihydrofolate reductase
Synonyms:
DYR_RAT Dihydrofolate reductase (DHFR) Tetrahydrofolate dehydrogenase
Type:
Enzyme
Mol. Mass.:
21638.84
Organism:
Rattus norvegicus (rat)
Description:
Residue:
187
  
Inhibitor
Name:
BDBM18268
Synonyms:
5-methyl-6-{[(3,4,5-trimethoxyphenyl)amino]methyl}quinazoline-2,4-diamine TMQ US11111252, Compound TMQ | US11530198, Example Trimetrexate
Type:
Small organic molecule
Emp. Form.:
C19H23N5O3
Mol. Mass.:
369.4176
SMILES:
COc1cc(NCc2ccc3nc(N)nc(N)c3c2C)cc(OC)c1OC
: