Target
Dihydrofolate reductase
Ligand
BDBM50067859
Substrate
Meas. Tech.
ChEMBL_55108 (CHEMBL665435)
IC50
1400±n/a nM
Citation
 Gangjee, AZhu, YQueener, SF 6-Substituted 2,4-diaminopyrido[3,2-d]pyrimidine analogues of piritrexim as inhibitors of dihydrofolate reductase from rat liver, Pneumocystis carinii, and Toxoplasma gondii and as antitumor agents. J Med Chem 41:4533-41 (1998)  
Target
Name:
Dihydrofolate reductase
Synonyms:
DYR_RAT Dihydrofolate reductase (DHFR) Tetrahydrofolate dehydrogenase
Type:
Enzyme
Mol. Mass.:
21638.84
Organism:
Rattus norvegicus (rat)
Description:
Residue:
187
  
Inhibitor
Name:
BDBM50067859
Synonyms:
CHEMBL141808 | N*6*-(3,4,5-Trimethoxy-benzyl)-pyrido[3,2-d]pyrimidine-2,4,6-triamine
Type:
Small organic molecule
Emp. Form.:
C17H20N6O3
Mol. Mass.:
356.3791
SMILES:
COc1cc(CNc2ccc3nc(N)nc(N)c3n2)cc(OC)c1OC
: