Target
Dihydrofolate reductase
Ligand
BDBM50067874
Substrate
Meas. Tech.
ChEMBL_55108 (CHEMBL665435)
IC50
430.0±n/a nM
Citation
 Gangjee, AZhu, YQueener, SF 6-Substituted 2,4-diaminopyrido[3,2-d]pyrimidine analogues of piritrexim as inhibitors of dihydrofolate reductase from rat liver, Pneumocystis carinii, and Toxoplasma gondii and as antitumor agents. J Med Chem 41:4533-41 (1998)  
Target
Name:
Dihydrofolate reductase
Synonyms:
DYR_RAT Dihydrofolate reductase (DHFR) Tetrahydrofolate dehydrogenase
Type:
Enzyme
Mol. Mass.:
21638.84
Organism:
Rattus norvegicus (rat)
Description:
Residue:
187
  
Inhibitor
Name:
BDBM50067874
Synonyms:
CHEMBL139188 | N*6*-Phenyl-pyrido[3,2-d]pyrimidine-2,4,6-triamine
Type:
Small organic molecule
Emp. Form.:
C13H12N6
Mol. Mass.:
252.2746
SMILES:
Nc1nc(N)c2nc(Nc3ccccc3)ccc2n1
: