Target
Chymotrypsinogen A
Ligand
BDBM26140
Substrate
Meas. Tech.
ChEMBL_34119 (CHEMBL649747)
IC50
14000±n/a nM
Citation
 Weston, GSBlázquez, JBaquero, FShoichet, BK Structure-based enhancement of boronic acid-based inhibitors of AmpC beta-lactamase. J Med Chem 41:4577-86 (1998)  
Target
Name:
Chymotrypsinogen A
Synonyms:
Alpha-chymotrypsin Chymotrypsin A Chymotrypsin A chain B Chymotrypsinogen A | alpha-Chymotrypsin (α-Chymotrypsin)
Type:
Serine protease
Mol. Mass.:
25670.88
Organism:
Bos taurus (bovine)
Description:
Residue:
245
  
Inhibitor
Name:
BDBM26140
Synonyms:
1-benzofuran-2-ylboranediol CHEMBL143399 | Phenylboronic acid, 21
Type:
Small organic molecule
Emp. Form.:
C8H7BO3
Mol. Mass.:
161.95
SMILES:
OB(O)c1cc2ccccc2o1
: