Target
Beta-lactamase
Ligand
BDBM50067906
Substrate
Meas. Tech.
ChEMBL_35528 (CHEMBL649554)
Ki
7300±n/a nM
Citation
 Weston, GSBlázquez, JBaquero, FShoichet, BK Structure-based enhancement of boronic acid-based inhibitors of AmpC beta-lactamase. J Med Chem 41:4577-86 (1998)  
Target
Name:
Beta-lactamase
Synonyms:
AMPC_ECOLI Beta-lactamase (AmpC) Cephalosporinase ampA | ampC
Type:
Protien
Mol. Mass.:
41561.62
Organism:
Escherichia coli
Description:
P00811
Residue:
377
  
Inhibitor
Name:
BDBM50067906
Synonyms:
(3-aminophenyl)boronic acid, 1 3-aminophenylboronic acid Boronic acid derivative M-AMINOPHENYLBORONIC ACID
Type:
Small organic molecule
Emp. Form.:
C6H8BNO2
Mol. Mass.:
136.944
SMILES:
Nc1cccc(c1)B(O)O
: