Target
D(2) dopamine receptor
Ligand
BDBM50068366
Substrate
Meas. Tech.
ChEMBL_59918 (CHEMBL670113)
IC50
>1000±n/a nM
Citation
 Perrone, RBerardi, FColabufo, NALeopoldo, MTortorella, V N-[2-[4-(4-Chlorophenyl)piperazin-1-yl]ethyl]-3-methoxybenzamide: a potent and selective dopamine D4 ligand. J Med Chem 41:4903-9 (1998)  
Target
Name:
D(2) dopamine receptor
Synonyms:
D(2) dopamine receptor DOPAMINE D2 Long DRD2 Dopamine D2 receptor Dopamine D2 receptor (D2R) Dopamine2-like | d2
Type:
Cell-surface receptors
Mol. Mass.:
50647.10
Organism:
Homo sapiens (Human)
Description:
P14416
Residue:
443
  
Inhibitor
Name:
BDBM50068366
Synonyms:
CHEMBL93403 | N-{2-[4-(4-Chloro-phenyl)-piperazin-1-yl]-ethyl}-3-methoxy-benzamide
Type:
Small organic molecule
Emp. Form.:
C20H24ClN3O2
Mol. Mass.:
373.876
SMILES:
COc1cccc(c1)C(=O)NCCN1CCN(CC1)c1ccc(Cl)cc1
: