Target
Carbonic anhydrase 7
Ligand
BDBM50513286
Substrate
Meas. Tech.
ChEMBL_1852930 (CHEMBL4353554)
Ki
0.200000±n/a nM
Citation
 Angeli, ADi Cesare Mannelli, LGhelardini, CPeat, TSBartolucci, GMenicatti, MCarta, FSupuran, CT Benzensulfonamides bearing spyrohydantoin moieties act as potent inhibitors of human carbonic anhydrases II and VII and show neuropathic pain attenuating effects. Eur J Med Chem 177:188-197 (2019)  
Target
Name:
Carbonic anhydrase 7
Synonyms:
CA-VII CAH7_HUMAN Carbonic anhydrase Carbonic anhydrase VII (CA VII)
Type:
Enzyme
Mol. Mass.:
29664.11
Organism:
Homo sapiens (Human)
Description:
Human cloned isozyme.
Residue:
264
  
Inhibitor
Name:
BDBM50513286
Synonyms:
CHEMBL4470319
Type:
Small organic molecule
Emp. Form.:
C23H26N4O5SSe
Mol. Mass.:
549.5
SMILES:
[#7]S(=O)(=O)c1ccc(-[#6][Se;v2]c2ccc(-[#7]-[#6](=O)-[#6]-[#7]-3-[#6](=O)-[#7]C4([#6]-[#6]-[#6]-[#6]-[#6]4)[#6]-3=O)cc2)cc1
: