Target
Glucagon receptor
Ligand
BDBM50068621
Substrate
Meas. Tech.
ChEMBL_72990 (CHEMBL680803)
Ki
>500000±n/a nM
Citation
 Madsen, PKnudsen, LBWiberg, FCCarr, RD Discovery and structure-activity relationship of the first non-peptide competitive human glucagon receptor antagonists. J Med Chem 41:5150-7 (1999)  
Target
Name:
Glucagon receptor
Synonyms:
GCGR GLR_HUMAN Glucagon receptor (GlucR)
Type:
Enzyme
Mol. Mass.:
54026.92
Organism:
Homo sapiens (Human)
Description:
P47871
Residue:
477
  
Inhibitor
Name:
BDBM50068621
Synonyms:
2-(1H-Benzoimidazol-2-ylsulfanyl)-1-(3,4-dichloro-phenyl)-ethanone | CHEMBL342535
Type:
Small organic molecule
Emp. Form.:
C15H10Cl2N2OS
Mol. Mass.:
337.224
SMILES:
Clc1ccc(cc1Cl)C(=O)CSc1nc2ccccc2[nH]1
: