Target
D(2) dopamine receptor
Ligand
BDBM50048803
Substrate
Meas. Tech.
ChEMBL_1853389 (CHEMBL4354013)
Ki
0.851138±n/a nM
Target
Name:
D(2) dopamine receptor
Synonyms:
D(2) dopamine receptor DOPAMINE D2 Long DRD2 Dopamine D2 receptor Dopamine D2 receptor (D2R) Dopamine2-like | d2
Type:
Cell-surface receptors
Mol. Mass.:
50647.10
Organism:
Homo sapiens (Human)
Description:
P14416
Residue:
443
  
Inhibitor
Name:
BDBM50048803
Synonyms:
5-(2-(4-(benzo[d]isothiazol-3-yl)piperazin-1-yl)ethyl)-6-chloroindolin-2-one 5-[2-(4-Benzo[d]isothiazol-3-yl-piperazin-1-yl)-ethyl]-6-chloro-1,3-dihydro-indol-2-one (Ziprasidone) CHEMBL708 ZIPRASIDONE | ZIPRASIDONE HYDROCHLORIDE
Type:
Small organic molecule
Emp. Form.:
C21H21ClN4OS
Mol. Mass.:
412.936
SMILES:
Clc1cc2NC(=O)Cc2cc1CCN1CCN(CC1)c1nsc2ccccc12
: