Target
Adenosine receptor A2a
Ligand
BDBM50513528
Substrate
Meas. Tech.
ChEMBL_1853617 (CHEMBL4354241)
EC50
4.3±n/a nM
Citation
 Zhang, MFan, SZhou, XXie, FLi, SZhong, W Design, synthesis and biological evaluation of 2-hydrazinyladenosine derivatives as A Eur J Med Chem 179:310-324 (2019)  
Target
Name:
Adenosine receptor A2a
Synonyms:
A2A adenosine receptor (hA2A) ADENOSINE A2 ADORA2 Adenosine A2A receptor (A2AAR)
Type:
G Protein-Coupled Receptor (GPCR)
Mol. Mass.:
44716.46
Organism:
Homo sapiens (Human)
Description:
P29274
Residue:
412
  
Inhibitor
Name:
BDBM50513528
Synonyms:
CHEMBL4440214
Type:
Small organic molecule
Emp. Form.:
C16H23N7O4
Mol. Mass.:
377.3983
SMILES:
Nc1nc(N\N=C\C2CCCC2)nc2n(cnc12)[C@@H]1O[C@H](CO)[C@@H](O)[C@H]1O
: