Target
Adenosine receptor A2a
Ligand
BDBM50513554
Substrate
Meas. Tech.
ChEMBL_1853617 (CHEMBL4354241)
EC50
1.4±n/a nM
Citation
 Zhang, MFan, SZhou, XXie, FLi, SZhong, W Design, synthesis and biological evaluation of 2-hydrazinyladenosine derivatives as A Eur J Med Chem 179:310-324 (2019)  
Target
Name:
Adenosine receptor A2a
Synonyms:
A2A adenosine receptor (hA2A) ADENOSINE A2 ADORA2 Adenosine A2A receptor (A2AAR)
Type:
G Protein-Coupled Receptor (GPCR)
Mol. Mass.:
44716.46
Organism:
Homo sapiens (Human)
Description:
P29274
Residue:
412
  
Inhibitor
Name:
BDBM50513554
Synonyms:
CHEMBL4438487
Type:
Small organic molecule
Emp. Form.:
C23H31N7O4
Mol. Mass.:
469.5367
SMILES:
CC(Cc1ccc(cc1)C(C)C)\C=N\Nc1nc(N)c2ncn([C@@H]3O[C@H](CO)[C@@H](O)[C@H]3O)c2n1
: