Target
Adenosine receptor A2a
Ligand
BDBM50513551
Substrate
Meas. Tech.
ChEMBL_1853617 (CHEMBL4354241)
EC50
1.1±n/a nM
Citation
 Zhang, MFan, SZhou, XXie, FLi, SZhong, W Design, synthesis and biological evaluation of 2-hydrazinyladenosine derivatives as A Eur J Med Chem 179:310-324 (2019)  
Target
Name:
Adenosine receptor A2a
Synonyms:
A2A adenosine receptor (hA2A) ADENOSINE A2 ADORA2 Adenosine A2A receptor (A2AAR)
Type:
G Protein-Coupled Receptor (GPCR)
Mol. Mass.:
44716.46
Organism:
Homo sapiens (Human)
Description:
P29274
Residue:
412
  
Inhibitor
Name:
BDBM50513551
Synonyms:
CHEMBL4447310
Type:
Small organic molecule
Emp. Form.:
C18H24ClN9O4
Mol. Mass.:
465.894
SMILES:
CCCCc1nc(\C=N\Nc2nc(N)c3ncn([C@@H]4O[C@H](CO)[C@@H](O)[C@H]4O)c3n2)c(Cl)[nH]1
: