Target
D(2) dopamine receptor
Ligand
BDBM50069043
Substrate
Meas. Tech.
ChEBML_58463
Ki
918±n/a nM
Citation
 Sanner, MAChappie, TADunaiskis, ARFliri, AFDesai, KAZorn, SHJackson, ERJohnson, CGMorrone, JMSeymour, PAMajchrzak, MJFaraci, WSCollins, JLDuignan, DBPrete Di, CCLee, JSTrozzi, A Synthesis, SAR and pharmacology of CP-293,019: a potent, selective dopamine D4 receptor antagonist. Bioorg Med Chem Lett 8:725-30 (1999)  
Target
Name:
D(2) dopamine receptor
Synonyms:
D(2) dopamine receptor DOPAMINE D2 Long DRD2 Dopamine D2 receptor Dopamine D2 receptor (D2R) Dopamine2-like | d2
Type:
Cell-surface receptors
Mol. Mass.:
50647.10
Organism:
Homo sapiens (Human)
Description:
P14416
Residue:
443
  
Inhibitor
Name:
BDBM50069043
Synonyms:
(7R,9aS)-7-(4-Methoxy-phenoxymethyl)-2-pyrimidin-2-yl-octahydro-pyrido[1,2-a]pyrazine | CHEMBL351098
Type:
Small organic molecule
Emp. Form.:
C20H26N4O2
Mol. Mass.:
354.446
SMILES:
COc1ccc(OC[C@@H]2CC[C@H]3CN(CCN3C2)c2ncccn2)cc1
: