Target
Mitogen-activated protein kinase kinase kinase 20
Ligand
BDBM50513870
Substrate
Meas. Tech.
ChEMBL_1854813 (CHEMBL4355542)
IC50
2.3±n/a nM
Citation
 Yang, JShibu, MAKong, LLuo, JBadrealamKhan, FHuang, YTu, ZCYun, CHHuang, CYDing, KLu, X Design, Synthesis, and Structure-Activity Relationships of 1,2,3-Triazole Benzenesulfonamides as New Selective Leucine-Zipper and Sterile-? Motif Kinase (ZAK) Inhibitors. J Med Chem 63:2114-2130 (2020)  
Target
Name:
Mitogen-activated protein kinase kinase kinase 20
Synonyms:
M3K20_HUMAN MLK7 Mixed lineage kinase 7 | ZAK
Type:
PROTEIN
Mol. Mass.:
91168.58
Organism:
Homo sapiens (Human)
Description:
ChEMBL_1495629
Residue:
800
  
Inhibitor
Name:
BDBM50513870
Synonyms:
CHEMBL4526537
Type:
Small organic molecule
Emp. Form.:
C22H17F2N7O4S
Mol. Mass.:
513.477
SMILES:
COc1n[nH]c2ncc(cc12)-c1cn(nn1)-c1c(F)ccc(NS(=O)(=O)c2cccc(OC)c2)c1F
: