Target
Mitogen-activated protein kinase kinase kinase 20
Ligand
BDBM50513880
Substrate
Meas. Tech.
ChEMBL_1854813 (CHEMBL4355542)
IC50
8.9±n/a nM
Citation
 Yang, JShibu, MAKong, LLuo, JBadrealamKhan, FHuang, YTu, ZCYun, CHHuang, CYDing, KLu, X Design, Synthesis, and Structure-Activity Relationships of 1,2,3-Triazole Benzenesulfonamides as New Selective Leucine-Zipper and Sterile-? Motif Kinase (ZAK) Inhibitors. J Med Chem 63:2114-2130 (2020)  
Target
Name:
Mitogen-activated protein kinase kinase kinase 20
Synonyms:
M3K20_HUMAN MLK7 Mixed lineage kinase 7 | ZAK
Type:
PROTEIN
Mol. Mass.:
91168.58
Organism:
Homo sapiens (Human)
Description:
ChEMBL_1495629
Residue:
800
  
Inhibitor
Name:
BDBM50513880
Synonyms:
CHEMBL4559022
Type:
Small organic molecule
Emp. Form.:
C18H12ClF2N7O2S
Mol. Mass.:
463.848
SMILES:
Nc1ncc(cn1)-c1cn(nn1)-c1c(F)ccc(NS(=O)(=O)c2cccc(Cl)c2)c1F
: