Target
Cannabinoid receptor 2
Ligand
BDBM50244276
Substrate
Meas. Tech.
ChEMBL_1855547 (CHEMBL4356276)
Ki
37±n/a nM
Citation
 Scheiner, MDolles, DGunesch, SHoffmann, MNabissi, MMarinelli, ONaldi, MBartolini, MPetralla, SPoeta, EMonti, BFalkeis, CVieth, MHübner, HGmeiner, PMaitra, RMaurice, TDecker, M Dual-Acting Cholinesterase-Human Cannabinoid Receptor 2 Ligands Show Pronounced Neuroprotection in Vitro and Overadditive and Disease-Modifying Neuroprotective Effects in Vivo. J Med Chem 62:9078-9102 (2019)  
Target
Name:
Cannabinoid receptor 2
Synonyms:
CANNABINOID CB2 CB2 CB2B CNR2_HUMAN Cannabinoid CB2 receptor Cannabinoid receptor 2 (CB2R) | hCB2
Type:
G Protein-Coupled Receptor (GPCR)
Mol. Mass.:
39690.94
Organism:
Homo sapiens (Human)
Description:
P34972
Residue:
360
  
Inhibitor
Name:
BDBM50244276
Synonyms:
2-(4-ethoxybenzyl)-N,N-diethyl-1-isopentyl-1H-benzo[d]imidazole-5-carboxamide | CHEMBL471980
Type:
Small organic molecule
Emp. Form.:
C26H35N3O2
Mol. Mass.:
421.575
SMILES:
CCOc1ccc(Cc2nc3cc(ccc3n2CCC(C)C)C(=O)N(CC)CC)cc1
: