Target
Induced myeloid leukemia cell differentiation protein Mcl-1
Ligand
BDBM50514197
Substrate
Meas. Tech.
ChEMBL_1855858 (CHEMBL4356587)
Ki
0.500000±n/a nM
Citation
 Rescourio, GGonzalez, AZJabri, SBelmontes, BMoody, GWhittington, DHuang, XCaenepeel, SCardozo, MCheng, ACChow, DDou, HJones, AKelly, RCLi, YLizarzaburu, MLo, MCMallari, RMeleza, CRew, YSimonovich, SSun, DTurcotte, SYan, XWong, SGYanez, EZancanella, MHouze, JMedina, JCHughes, PEBrown, SP Discovery and in Vivo Evaluation of Macrocyclic Mcl-1 Inhibitors Featuring an ?-Hydroxy Phenylacetic Acid Pharmacophore or Bioisostere. J Med Chem 62:10258-10271 (2019)  
Target
Name:
Induced myeloid leukemia cell differentiation protein Mcl-1
Synonyms:
BCL2L3 Bcl-2-like protein 3 (Mcl-1) Bcl2-L-3 MCL1 Mcl-1 Myeloid cell leukemia sequence 1 (BCL2-related) | mcl1/EAT
Type:
Membrane; Single-pass membrane protein
Mol. Mass.:
37332.87
Organism:
Homo sapiens (Human)
Description:
Q07820
Residue:
350
  
Inhibitor
Name:
BDBM50514197
Synonyms:
CHEMBL4561691 | US11274105, Example 63
Type:
Small organic molecule
Emp. Form.:
C30H35ClN2O5
Mol. Mass.:
539.062
SMILES:
CN1C\C=C\CCCCN2C[C@@]3(CCCc4cc(Cl)ccc34)COc3ccc(cc23)[C@](O)(CC1=O)C(O)=O
: