Target
Induced myeloid leukemia cell differentiation protein Mcl-1
Ligand
BDBM50514216
Substrate
Meas. Tech.
ChEMBL_1855858 (CHEMBL4356587)
Ki
0.100000±n/a nM
Citation
 Rescourio, GGonzalez, AZJabri, SBelmontes, BMoody, GWhittington, DHuang, XCaenepeel, SCardozo, MCheng, ACChow, DDou, HJones, AKelly, RCLi, YLizarzaburu, MLo, MCMallari, RMeleza, CRew, YSimonovich, SSun, DTurcotte, SYan, XWong, SGYanez, EZancanella, MHouze, JMedina, JCHughes, PEBrown, SP Discovery and in Vivo Evaluation of Macrocyclic Mcl-1 Inhibitors Featuring an ?-Hydroxy Phenylacetic Acid Pharmacophore or Bioisostere. J Med Chem 62:10258-10271 (2019)  
Target
Name:
Induced myeloid leukemia cell differentiation protein Mcl-1
Synonyms:
BCL2L3 Bcl-2-like protein 3 (Mcl-1) Bcl2-L-3 MCL1 Mcl-1 Myeloid cell leukemia sequence 1 (BCL2-related) | mcl1/EAT
Type:
Membrane; Single-pass membrane protein
Mol. Mass.:
37332.87
Organism:
Homo sapiens (Human)
Description:
Q07820
Residue:
350
  
Inhibitor
Name:
BDBM50514216
Synonyms:
CHEMBL4528051 | US11274105, Example 5
Type:
Small organic molecule
Emp. Form.:
C36H47ClN4O7S
Mol. Mass.:
715.299
SMILES:
[H][C@@]12CC[C@@]1([H])[C@@H](OC)\C=C\CCN(C)C(=O)C[C@](O)(C(=O)NS(=O)(=O)N(C)C)c1ccc3OC[C@]4(CCCc5cc(Cl)ccc45)CN(C2)c3c1
: