Target
Excitatory amino acid transporter 2
Ligand
BDBM50327884
Substrate
Meas. Tech.
ChEMBL_1856371 (CHEMBL4357100)
IC50
17±n/a nM
Citation
 Wang, WWGallo, LJadhav, AHawkins, RParker, CG The Druggability of Solute Carriers. J Med Chem 63:3834-3867 (2020)  
Target
Name:
Excitatory amino acid transporter 2
Synonyms:
EAA2_HUMAN GLT1 SLC1A2 Solute carrier family 1 member 2
Type:
Enzyme Catalytic Domain
Mol. Mass.:
62103.57
Organism:
Homo sapiens (Human)
Description:
Excitatory Amino Acid EAAT2 0 0::P43004
Residue:
574
  
Inhibitor
Name:
BDBM50327884
Synonyms:
(2S,3S)-2-amino-3-(3-(4-(trifluoromethyl)benzamido)benzyloxy)succinic acid | CHEMBL1257519
Type:
Small organic molecule
Emp. Form.:
C19H17F3N2O6
Mol. Mass.:
426.3433
SMILES:
N[C@@H]([C@H](OCc1cccc(NC(=O)c2ccc(cc2)C(F)(F)F)c1)C(O)=O)C(O)=O
: