Target
Interstitial collagenase
Ligand
BDBM50069583
Substrate
Meas. Tech.
ChEBML_70455
IC50
20±n/a nM
Citation
 Bailey, SBolognese, BBuckle, DRFaller, AJackson, SLouis-Flamberg, PMcCord, MMayer, RJMarshall, LASmith, DG Hydroxamate-based inhibitors of low affinity IgE receptor (CD23) processing. Bioorg Med Chem Lett 8:23-8 (1999)  
Target
Name:
Interstitial collagenase
Synonyms:
CLG MMP1 Matrix metalloproteinase-1 | Matrix metalloproteinase-1 (MMP-1)
Type:
Enzyme
Mol. Mass.:
54010.26
Organism:
Homo sapiens (Human)
Description:
P03956
Residue:
469
  
Inhibitor
Name:
BDBM50069583
Synonyms:
(R)-N*1*-((S)-1-Benzylcarbamoyl-2-phenyl-ethyl)-2-cyclopentylmethyl-N*4*-hydroxy-succinamide | CHEMBL420077
Type:
Small organic molecule
Emp. Form.:
C26H33N3O4
Mol. Mass.:
451.5579
SMILES:
ONC(=O)C[C@@H](CC1CCCC1)C(=O)N[C@@H](Cc1ccccc1)C(=O)NCc1ccccc1
: