Target
Interstitial collagenase
Ligand
BDBM50069610
Substrate
Meas. Tech.
ChEBML_70456
IC50
8±n/a nM
Citation
 Bailey, SBolognese, BBuckle, DRFaller, AJackson, SLouis-Flamberg, PMcCord, MMayer, RJMarshall, LASmith, DG Selective inhibition of low affinity IgE receptor (CD23) processing. Bioorg Med Chem Lett 8:29-34 (1999)  
Target
Name:
Interstitial collagenase
Synonyms:
CLG MMP1 Matrix metalloproteinase-1 | Matrix metalloproteinase-1 (MMP-1)
Type:
Enzyme
Mol. Mass.:
54010.26
Organism:
Homo sapiens (Human)
Description:
P03956
Residue:
469
  
Inhibitor
Name:
BDBM50069610
Synonyms:
(2R,3S)-N*1*-Hydroxy-2-(4-hydroxy-phenylsulfanylmethyl)-3-isobutyl-N*4*-((S)-1-methylcarbamoyl-2-phenyl-ethyl)-succinamide | CHEMBL114657
Type:
Small organic molecule
Emp. Form.:
C25H33N3O5S
Mol. Mass.:
487.612
SMILES:
CNC(=O)[C@H](Cc1ccccc1)NC(=O)[C@H](CC(C)C)[C@H](CSc1ccc(O)cc1)C(=O)NO
: