Target
Guanine nucleotide-binding protein G(I)/G(S)/G(O) subunit gamma-2/G(I)/G(S)/G(T) subunit beta-1
Ligand
BDBM50444748
Substrate
Meas. Tech.
ChEMBL_1856735 (CHEMBL4357464)
IC50
5000±n/a nM
Citation
 Li, JGe, YHuang, JXStrømgaard, KZhang, XXiong, XF Heterotrimeric G Proteins as Therapeutic Targets in Drug Discovery. J Med Chem 63:5013-5030 (2020)  
Target
Name:
Guanine nucleotide-binding protein G(I)/G(S)/G(O) subunit gamma-2/G(I)/G(S)/G(T) subunit beta-1
Synonyms:
Guanine nucleotide-binding protein G(I)/G(S)/G(T) subunit beta-1/gamma-2
Type:
Mol. Mass.:
Description:
ASSAY_ID of ChEMBL is 1856735
Components:
This complex has 2 components.
Component 1
Name:
Guanine nucleotide-binding protein G(I)/G(S)/G(T) subunit beta-1
Synonyms:
GBB1_HUMAN Guanine nucleotide-binding protein G(I)/G(S)/G(T) subunit beta-1 | Transducin beta chain 1
Type:
PROTEIN
Mol. Mass.:
37373.57
Organism:
Homo sapiens
Description:
ChEMBL_117032
Residue:
340
  
Component 2
Name:
Guanine nucleotide-binding protein G(I)/G(S)/G(O) subunit gamma-2
Synonyms:
G gamma-I GNG2 | Guanine nucleotide-binding protein G(I)/G(S)/G(O) subunit gamma-2
Type:
PROTEIN
Mol. Mass.:
7851.57
Organism:
Homo sapiens
Description:
ChEMBL_117032
Residue:
71
  
Inhibitor
Name:
BDBM50444748
Synonyms:
Aminoquinuride
Type:
Small organic molecule
Emp. Form.:
C21H20N6O
Mol. Mass.:
372.4231
SMILES:
Cc1cc(N)c2cc(NC(=O)Nc3ccc4nc(C)cc(N)c4c3)ccc2n1
: