Target
Plasmepsin I
Ligand
BDBM50514491
Substrate
Meas. Tech.
ChEMBL_1856928 (CHEMBL4357657)
IC50
100±n/a nM
Citation
 Cheuka, PMDziwornu, GOkombo, JChibale, K Plasmepsin Inhibitors in Antimalarial Drug Discovery: Medicinal Chemistry and Target Validation (2000 to Present). J Med Chem 63:4445-4467 (2020)  
Target
Name:
Plasmepsin I
Synonyms:
PFAPG PMI Plasmepsin-1 precursor
Type:
Enzyme
Mol. Mass.:
51463.30
Organism:
Plasmodium falciparum
Description:
Residue:
452
  
Inhibitor
Name:
BDBM50514491
Synonyms:
CHEMBL4556003
Type:
Small organic molecule
Emp. Form.:
C34H45N3O2S
Mol. Mass.:
559.805
SMILES:
CCCCCc1ccc(cc1)S(=O)(=O)C1C(NCc2ccc3ccccc3c2)C2CC(CNC3CCCC3)C1N2
: