Target
Plasmepsin I
Ligand
BDBM50514492
Substrate
Meas. Tech.
ChEMBL_1856928 (CHEMBL4357657)
IC50
2000±n/a nM
Citation
 Cheuka, PMDziwornu, GOkombo, JChibale, K Plasmepsin Inhibitors in Antimalarial Drug Discovery: Medicinal Chemistry and Target Validation (2000 to Present). J Med Chem 63:4445-4467 (2020)  
Target
Name:
Plasmepsin I
Synonyms:
PFAPG PMI Plasmepsin-1 precursor
Type:
Enzyme
Mol. Mass.:
51463.30
Organism:
Plasmodium falciparum
Description:
Residue:
452
  
Inhibitor
Name:
BDBM50514492
Synonyms:
CHEMBL4435432
Type:
Small organic molecule
Emp. Form.:
C26H30Cl3NO
Mol. Mass.:
478.882
SMILES:
CCCCN(CCCC)CC(O)c1cc(Cl)cc2cc(ccc12)-c1ccc(Cl)c(Cl)c1
: