Target
Plasmepsin I
Ligand
BDBM50514502
Substrate
Meas. Tech.
ChEMBL_1856928 (CHEMBL4357657)
IC50
655±n/a nM
Citation
 Cheuka, PMDziwornu, GOkombo, JChibale, K Plasmepsin Inhibitors in Antimalarial Drug Discovery: Medicinal Chemistry and Target Validation (2000 to Present). J Med Chem 63:4445-4467 (2020)  
Target
Name:
Plasmepsin I
Synonyms:
PFAPG PMI Plasmepsin-1 precursor
Type:
Enzyme
Mol. Mass.:
51463.30
Organism:
Plasmodium falciparum
Description:
Residue:
452
  
Inhibitor
Name:
BDBM50514502
Synonyms:
CHEMBL1233569
Type:
Small organic molecule
Emp. Form.:
C37H44N4O3
Mol. Mass.:
592.7703
SMILES:
CCCCCc1ccc(cc1)C(=O)N(Cc1ccc(cc1)-c1ccc(CC(=O)OC)cc1)C1CCN(Cc2ncc[nH]2)CC1
: