Target
Plasmepsin I
Ligand
BDBM50514488
Substrate
Meas. Tech.
ChEMBL_1856928 (CHEMBL4357657)
IC50
1162±n/a nM
Citation
 Cheuka, PMDziwornu, GOkombo, JChibale, K Plasmepsin Inhibitors in Antimalarial Drug Discovery: Medicinal Chemistry and Target Validation (2000 to Present). J Med Chem 63:4445-4467 (2020)  
Target
Name:
Plasmepsin I
Synonyms:
PFAPG PMI Plasmepsin-1 precursor
Type:
Enzyme
Mol. Mass.:
51463.30
Organism:
Plasmodium falciparum
Description:
Residue:
452
  
Inhibitor
Name:
BDBM50514488
Synonyms:
CHEMBL4543535
Type:
Small organic molecule
Emp. Form.:
C39H50N4O
Mol. Mass.:
590.8405
SMILES:
CCCCCc1ccc(cc1)C(=O)N(Cc1ccc(Nc2cc(C)nc3ccccc23)cc1)C1CCN(CCC(C)C)CC1
: