Target
Kynureninase
Ligand
BDBM50069729
Substrate
Meas. Tech.
ChEMBL_91725 (CHEMBL702023)
IC50
29000±n/a nM
Citation
 Drysdale, MJReinhard, JF S-aryl cysteine S,S-dioxides as inhibitors of mammalian kynureninase. Bioorg Med Chem Lett 8:133-8 (1999)  
Target
Name:
Kynureninase
Synonyms:
KYNU_RAT | Kynu
Type:
PROTEIN
Mol. Mass.:
52470.50
Organism:
Rattus norvegicus
Description:
ChEMBL_91725
Residue:
464
  
Inhibitor
Name:
BDBM50069729
Synonyms:
2-Amino-3-(2-amino-3-methoxy-benzenesulfonyl)-propionic acid | CHEMBL30201
Type:
Small organic molecule
Emp. Form.:
C10H14N2O5S
Mol. Mass.:
274.294
SMILES:
COc1cccc(c1N)S(=O)(=O)CC(N)C(O)=O
: