Target
Inositol 1,4,5-trisphosphate receptor type 1
Ligand
BDBM50514586
Substrate
Meas. Tech.
ChEMBL_1857661 (CHEMBL4358390)
Kd
1.4±n/a nM
Citation
 Mills, SJRossi, AMKonieczny, VBakowski, DTaylor, CWPotter, BVL d- J Med Chem 63:3238-3251 (2020)  
Target
Name:
Inositol 1,4,5-trisphosphate receptor type 1
Synonyms:
ITPR1_RAT Itpr1
Type:
PROTEIN
Mol. Mass.:
313234.63
Organism:
Rattus norvegicus
Description:
ChEMBL_818416
Residue:
2750
  
Inhibitor
Name:
BDBM50514586
Synonyms:
CHEMBL4578747
Type:
Small organic molecule
Emp. Form.:
C12H25O19P3
Mol. Mass.:
566.2368
SMILES:
[H][C@]1(O[C@@H]2[C@@H](CO)O[C@@H](OC)[C@@H]2OP(O)(O)=O)[C@H](O)[C@H](O)[C@@H](OP(O)(O)=O)[C@H](OP(O)(O)=O)[C@H]1O
: