Target
Tyrosine-protein kinase BTK
Ligand
BDBM291522
Substrate
Meas. Tech.
ChEMBL_1857785 (CHEMBL4358514)
Kd
16±n/a nM
Citation
 Angst, DGessier, FJanser, PVulpetti, AWälchli, RBeerli, CLittlewood-Evans, ADawson, JNuesslein-Hildesheim, BWieczorek, GGutmann, SScheufler, CHinniger, AZimmerlin, AFunhoff, EGPulz, RCenni, B Discovery of LOU064 (Remibrutinib), a Potent and Highly Selective Covalent Inhibitor of Bruton's Tyrosine Kinase. J Med Chem 63:5102-5118 (2020)  
Target
Name:
Tyrosine-protein kinase BTK
Synonyms:
AGMX1 Agammaglobulinaemia tyrosine kinase B cell progenitor kinase BPK BTK_HUMAN Tyrosine Kinase BTK Tyrosine-protein kinase BTK (BTK)
Type:
Enzyme
Mol. Mass.:
76289.95
Organism:
Homo sapiens (Human)
Description:
Q06187
Residue:
659
  
Inhibitor
Name:
BDBM291522
Synonyms:
1-(4-(((6-amino-5-(4-phenoxyphenyl)pyrimidin-4-yl)amino)methyl)piperidin-1-yl)prop-2-en-1-one US9580449, Example A250 | US9580449, Example A39
Type:
Small organic molecule
Emp. Form.:
C25H27N5O2
Mol. Mass.:
429.5142
SMILES:
Nc1ncnc(NCC2CCN(CC2)C(=O)C=C)c1-c1ccc(Oc2ccccc2)cc1
: