Target
Tyrosine-protein kinase BTK
Ligand
BDBM164638
Substrate
Meas. Tech.
ChEMBL_1857785 (CHEMBL4358514)
Kd
0.560000±n/a nM
Citation
 Angst, DGessier, FJanser, PVulpetti, AWälchli, RBeerli, CLittlewood-Evans, ADawson, JNuesslein-Hildesheim, BWieczorek, GGutmann, SScheufler, CHinniger, AZimmerlin, AFunhoff, EGPulz, RCenni, B Discovery of LOU064 (Remibrutinib), a Potent and Highly Selective Covalent Inhibitor of Bruton's Tyrosine Kinase. J Med Chem 63:5102-5118 (2020)  
Target
Name:
Tyrosine-protein kinase BTK
Synonyms:
AGMX1 Agammaglobulinaemia tyrosine kinase B cell progenitor kinase BPK BTK_HUMAN Tyrosine Kinase BTK Tyrosine-protein kinase BTK (BTK)
Type:
Enzyme
Mol. Mass.:
76289.95
Organism:
Homo sapiens (Human)
Description:
Q06187
Residue:
659
  
Inhibitor
Name:
BDBM164638
Synonyms:
BDBM166759 US11623921, Example 223 US9802915, Example 123 | US9920031, Example 223
Type:
Small organic molecule
Emp. Form.:
C20H23FN4O2
Mol. Mass.:
370.4206
SMILES:
CC#CC(=O)N[C@H]1CCCN(C1)c1c(F)cc(C(N)=O)c2[nH]c(C)c(C)c12
: