Target
Thermolysin
Ligand
BDBM50025924
Substrate
Meas. Tech.
ChEBML_210386
pH
7.2±n/a
Ki
340000±n/a nM
Comments
extracted
Citation
 Lee, KJKim, DH Inhibition of thermolysin with nitrone-bearing substrate analogs: a new type of thermolysin inhibitors. Bioorg Med Chem Lett 8:323-6 (1999)  
Target
Name:
Thermolysin
Synonyms:
THER_BACTH | npr
Type:
PROTEIN
Mol. Mass.:
60097.54
Organism:
Bacillus thermoproteolyticus
Description:
ChEMBL_1468794
Residue:
548
  
Inhibitor
Name:
BDBM50025924
Synonyms:
3-Benzyl-N-carboxymethyl-succinamic acid | CHEMBL16675
Type:
Small organic molecule
Emp. Form.:
C13H15NO5
Mol. Mass.:
265.2619
SMILES:
OC(=O)CNC(=O)C(CC(O)=O)Cc1ccccc1
: