Target
Thermolysin
Ligand
BDBM50069975
Substrate
Meas. Tech.
ChEBML_210386
pH
7.2±n/a
Ki
54000±n/a nM
Comments
extracted
Citation
 Lee, KJKim, DH Inhibition of thermolysin with nitrone-bearing substrate analogs: a new type of thermolysin inhibitors. Bioorg Med Chem Lett 8:323-6 (1999)  
Target
Name:
Thermolysin
Synonyms:
THER_BACTH | npr
Type:
PROTEIN
Mol. Mass.:
60097.54
Organism:
Bacillus thermoproteolyticus
Description:
ChEMBL_1468794
Residue:
548
  
Inhibitor
Name:
BDBM50069975
Synonyms:
({(3Z)-2-benzyl-3-[benzyl(oxido)imino]propanoyl}amino)acetic acid | CHEMBL324458
Type:
Small organic molecule
Emp. Form.:
C19H20N2O4
Mol. Mass.:
340.3731
SMILES:
OC(=O)CNC(=O)C(Cc1ccccc1)\C=[N+](/[O-])Cc1ccccc1
: