Target
Capsid scaffolding protein
Ligand
BDBM50070010
Substrate
Meas. Tech.
ChEBML_33815
IC50
20000±n/a nM
Citation
 Borthwick, ADWeingarten, GHaley, TMTomaszewski, MWang, WHu, ZBedard, JJin, HYuen, LMansour, TS Design and synthesis of monocyclic beta-lactams as mechanism-based inhibitors of human cytomegalovirus protease. Bioorg Med Chem Lett 8:365-70 (1999)  
Target
Name:
Capsid scaffolding protein
Synonyms:
APNG Assembly protein Human cytomegalovirus protease (HCMV Pr) Protease precursor UL80 | pPR
Type:
PROTEIN
Mol. Mass.:
73854.16
Organism:
Human cytomegalovirus (strain AD169) (HHV-5) (Human herpesvirus 5)
Description:
ChEMBL_158958
Residue:
708
  
Inhibitor
Name:
BDBM50070010
Synonyms:
4-((2R,3R)-1-Benzylcarbamoyl-3-methyl-4-oxo-azetidin-2-yloxy)-benzoic acid | CHEMBL122575
Type:
Small organic molecule
Emp. Form.:
C19H18N2O5
Mol. Mass.:
354.3566
SMILES:
C[C@@H]1[C@@H](Oc2ccc(cc2)C(O)=O)N(C(=O)NCc2ccccc2)C1=O
: