Target
Beta-3 adrenergic receptor
Ligand
BDBM50070132
Substrate
Meas. Tech.
ChEBML_38912
EC50
6.3±n/a nM
Citation
 Weber, AEMathvink, RJPerkins, LHutchins, JECandelore, MRTota, LStrader, CDWyvratt, MJFisher, MH Potent, selective benzenesulfonamide agonists of the human beta 3 adrenergic receptor. Bioorg Med Chem Lett 8:1101-6 (1999)  
Target
Name:
Beta-3 adrenergic receptor
Synonyms:
ADRB3 ADRB3_HUMAN Beta-2 adrenergic receptor and beta-3 adrenergic receptor Beta-3 adrenoreceptor | adrenergic Beta3
Type:
G Protein-Coupled Receptor (GPCR)
Mol. Mass.:
43534.88
Organism:
Homo sapiens (Human)
Description:
Residue:
408
  
Inhibitor
Name:
BDBM50070132
Synonyms:
(S)-N-(4-(2-(2-hydroxy-3-(4-hydroxyphenoxy)propylamino)ethyl)phenyl)benzenesulfonamide N-(4-{2-[(S)-2-Hydroxy-3-(4-hydroxy-phenoxy)-propylamino]-ethyl}-phenyl)-benzenesulfonamide
Type:
Small organic molecule
Emp. Form.:
C23H26N2O5S
Mol. Mass.:
442.528
SMILES:
O[C@@H](CNCCc1ccc(NS(=O)(=O)c2ccccc2)cc1)COc1ccc(O)cc1
: