Target
Beta-1 adrenergic receptor
Ligand
BDBM50070160
Substrate
Meas. Tech.
ChEBML_37377
IC50
880±n/a nM
Citation
 Parmee, EROk, HOCandelore, MRTota, LDeng, LStrader, CDWyvratt, MJFisher, MHWeber, AE Discovery of L-755,507: a subnanomolar human beta 3 adrenergic receptor agonist. Bioorg Med Chem Lett 8:1107-12 (1999)  
Target
Name:
Beta-1 adrenergic receptor
Synonyms:
ADRB1 ADRB1_HUMAN Beta-1 adrenoceptor adrenergic Beta1
Type:
G Protein-Coupled Receptor (GPCR)
Mol. Mass.:
51338.40
Organism:
Homo sapiens (Human)
Description:
P08588
Residue:
477
  
Inhibitor
Name:
BDBM50070160
Synonyms:
CHEMBL12943 | N-[4-(4-{2-[(S)-2-Hydroxy-3-(4-hydroxy-phenoxy)-propylamino]-ethyl}-phenylsulfamoyl)-phenyl]-propionamide
Type:
Small organic molecule
Emp. Form.:
C26H31N3O6S
Mol. Mass.:
513.606
SMILES:
CCC(=O)Nc1ccc(cc1)S(=O)(=O)Nc1ccc(CCNC[C@H](O)COc2ccc(O)cc2)cc1
: