Target
Beta-3 adrenergic receptor
Ligand
BDBM50070132
Substrate
Meas. Tech.
ChEBML_38911
EC50
6.3±n/a nM
Citation
 Parmee, EROk, HOCandelore, MRTota, LDeng, LStrader, CDWyvratt, MJFisher, MHWeber, AE Discovery of L-755,507: a subnanomolar human beta 3 adrenergic receptor agonist. Bioorg Med Chem Lett 8:1107-12 (1999)  
Target
Name:
Beta-3 adrenergic receptor
Synonyms:
ADRB3 ADRB3_HUMAN Beta-2 adrenergic receptor and beta-3 adrenergic receptor Beta-3 adrenoreceptor | adrenergic Beta3
Type:
G Protein-Coupled Receptor (GPCR)
Mol. Mass.:
43534.88
Organism:
Homo sapiens (Human)
Description:
Residue:
408
  
Inhibitor
Name:
BDBM50070132
Synonyms:
(S)-N-(4-(2-(2-hydroxy-3-(4-hydroxyphenoxy)propylamino)ethyl)phenyl)benzenesulfonamide N-(4-{2-[(S)-2-Hydroxy-3-(4-hydroxy-phenoxy)-propylamino]-ethyl}-phenyl)-benzenesulfonamide
Type:
Small organic molecule
Emp. Form.:
C23H26N2O5S
Mol. Mass.:
442.528
SMILES:
O[C@@H](CNCCc1ccc(NS(=O)(=O)c2ccccc2)cc1)COc1ccc(O)cc1
: