Target
Cholinesterase
Ligand
BDBM50515472
Substrate
Meas. Tech.
ChEMBL_1861128 (CHEMBL4361984)
Ki
1.1±n/a nM
Citation
 Roldán-Peña, JMRomero-Real, VHicke, JMaya, IFranconetti, ALagunes, IPadrón, JMPetralla, SPoeta, ENaldi, MBartolini, MMonti, BBolognesi, MLLópez, ÓFernández-Bolaños, JG Tacrine-O-protected phenolics heterodimers as multitarget-directed ligands against Alzheimer's disease: Selective subnanomolar BuChE inhibitors. Eur J Med Chem 181:0 (2019)  
Target
Name:
Cholinesterase
Synonyms:
BCHE CHLE_HORSE | Cholinesterase
Type:
Enzyme
Mol. Mass.:
65643.35
Organism:
Equus caballus (Horse)
Description:
P81908
Residue:
574
  
Inhibitor
Name:
BDBM50515472
Synonyms:
CHEMBL4469822
Type:
Small organic molecule
Emp. Form.:
C28H28N2O
Mol. Mass.:
408.5347
SMILES:
C(Cc1ccc(OCc2ccccc2)cc1)Nc1c2CCCCc2nc2ccccc12
: