Target
P-selectin
Ligand
BDBM50100506
Substrate
Meas. Tech.
ChEMBL_1861203 (CHEMBL4362059)
IC50
17000±n/a nM
Citation
 Gaikwad, NNanduri, SMadhavi, YV Cinnamamide: An insight into the pharmacological advances and structure-activity relationships. Eur J Med Chem 181:0 (2019)  
Target
Name:
P-selectin
Synonyms:
GMRP LYAM3_HUMAN P-selectin/P-selectin glycoprotein ligand 1 | SELP
Type:
PROTEIN
Mol. Mass.:
90834.61
Organism:
Homo sapiens (Human)
Description:
ChEMBL_1438999
Residue:
830
  
Inhibitor
Name:
BDBM50100506
Synonyms:
3-(4-{5-[4-(2-Hexadecylcarbamoyl-vinyl)-phenyl]-1H-imidazol-4-yl}-phenyl)-acrylic acid | CHEMBL293171
Type:
Small organic molecule
Emp. Form.:
C37H49N3O3
Mol. Mass.:
583.8033
SMILES:
CCCCCCCCCCCCCCCCNC(=O)C=Cc1ccc(cc1)-c1[nH]cnc1-c1ccc(C=CC(O)=O)cc1
: