Target
B2 bradykinin receptor
Ligand
BDBM50142954
Substrate
Meas. Tech.
ChEMBL_1861205 (CHEMBL4362061)
IC50
0.260000±n/a nM
Citation
 Gaikwad, NNanduri, SMadhavi, YV Cinnamamide: An insight into the pharmacological advances and structure-activity relationships. Eur J Med Chem 181:0 (2019)  
Target
Name:
B2 bradykinin receptor
Synonyms:
B2 BRADYKININ B2R BK-2 receptor BKRB2_HUMAN | Bradykinin B2 receptor
Type:
Enzyme Catalytic Domain
Mol. Mass.:
44467.17
Organism:
Homo sapiens (Human)
Description:
B2 BRADYKININ BDKRB2 HUMAN::P30411
Residue:
391
  
Inhibitor
Name:
BDBM50142954
Synonyms:
4-[(E)-2-({1-[2,4-Dichloro-3-(4-imidazol-1-yl-2-methyl-quinolin-8-yloxymethyl)-phenyl]-1H-pyrrol-2-ylmethyl}-carbamoyl)-vinyl]-N,N-dimethyl-benzamide; dihydrochloride | CHEMBL538233
Type:
Small organic molecule
Emp. Form.:
C37H32Cl2N6O3
Mol. Mass.:
679.594
SMILES:
CN(C)C(=O)c1ccc(\C=C\C(=O)NCc2cccn2-c2ccc(Cl)c(COc3cccc4c(cc(C)nc34)-n3ccnc3)c2Cl)cc1
: