Target
Cytochrome c oxidase subunit 1
Ligand
BDBM50515743
Substrate
Meas. Tech.
ChEMBL_1862265 (CHEMBL4363121)
IC50
39920±n/a nM
Citation
 Kumar, RSaha, NPurohit, PGarg, SKSeth, KMeena, VSDubey, SDave, KGoyal, RSharma, SSBanerjee, UCChakraborti, AK Cyclic enaminone as new chemotype for selective cyclooxygenase-2 inhibitory, anti-inflammatory, and analgesic activities. Eur J Med Chem 182:0 (2019)  
Target
Name:
Cytochrome c oxidase subunit 1
Synonyms:
COI COXI MTCO1
Type:
PROTEIN
Mol. Mass.:
57042.19
Organism:
Ovis aries
Description:
ChEMBL_662814
Residue:
514
  
Inhibitor
Name:
BDBM50515743
Synonyms:
CHEMBL4448990
Type:
Small organic molecule
Emp. Form.:
C14H14ClNO2
Mol. Mass.:
263.719
SMILES:
CC(=O)N(C1=CC(=O)CCC1)c1ccc(Cl)cc1
: