Target
Gag-Pol polyprotein [489-587]
Ligand
BDBM196
Substrate
Meas. Tech.
ChEBML_159627
IC50
3±n/a nM
Citation
 Medou, MBouygues, MRocheblave, LChermann, JCKraus, JL Synthesis and anti-HIV activities of symmetrical N1,N3-dibenzyl-2-hydroxy-propane derivatives. Bioorg Med Chem Lett 8:1861-6 (1999)  
Target
Name:
Gag-Pol polyprotein [489-587]
Synonyms:
Human immunodeficiency virus type 1 protease Pol polyprotein | gag-pol
Type:
Enzyme Subunit
Mol. Mass.:
10781.16
Organism:
Human immunodeficiency virus type 1
Description:
P04585[489-587]
Residue:
99
  
Inhibitor
Name:
BDBM196
Synonyms:
A-74704 benzyl N-[(1S)-1-{[(2S,4S)-4-[(2S)-2-{[(benzyloxy)carbonyl]amino}-3-methylbutanamido]-3-hydroxy-1,5-diphenylpentan-2-yl]carbamoyl}-2-methylpropyl]carbamate
Type:
Emp. Form.:
C43H52N4O7
Mol. Mass.:
736.8956
SMILES:
CC(C)[C@H](NC(=O)OCc1ccccc1)C(=O)N[C@@H](Cc1ccccc1)C(O)[C@H](Cc1ccccc1)NC(=O)[C@@H](NC(=O)OCc1ccccc1)C(C)C
: