Target
Inhibitor of nuclear factor kappa-B kinase subunit epsilon
Ligand
BDBM50516171
Substrate
Meas. Tech.
ChEMBL_1863445 (CHEMBL4364420)
Kd
1000±n/a nM
Citation
 Thomson, DWPoeckel, DZinn, NRau, CStrohmer, KWagner, AJGraves, APPerrin, JBantscheff, MDuempelfeld, BKasparcova, VRamanjulu, JMPesiridis, GSMuelbaier, MBergamini, G Discovery of GSK8612, a Highly Selective and Potent TBK1 Inhibitor. ACS Med Chem Lett 10:780-785 (2019)  
Target
Name:
Inhibitor of nuclear factor kappa-B kinase subunit epsilon
Synonyms:
I kappa-B kinase epsilon I-kappa-B kinase epsilon (IKK-E) IKBKE IKK-epsilon IKKE IKKI KIAA0151 | von Hippel-Lindau disease tumor suppressor/Inhibitor of nuclear factor kappa-B kinase subunit epsilon
Type:
Serine/threonine-protein kinase
Mol. Mass.:
80475.98
Organism:
Homo sapiens (Human)
Description:
Kinase inhibitory activity was determined using recombinant human IKK-epsilon expressed in baculovirus as a FLAG-tagged fusion protein.
Residue:
716
  
Inhibitor
Name:
BDBM50516171
Synonyms:
CHEMBL4446892
Type:
Small organic molecule
Emp. Form.:
C17H17BrF3N7O2S
Mol. Mass.:
520.327
SMILES:
Cc1nn(CC(F)(F)F)cc1Nc1ncc(Br)c(NCc2ccc(cc2)S(N)(=O)=O)n1
: