Target
72 kDa type IV collagenase
Ligand
BDBM50071267
Substrate
Meas. Tech.
ChEBML_101906
IC50
0.100000±n/a nM
Citation
 Steinman, DHCurtin, MLGarland, RBDavidsen, SKHeyman, HRHolms, JHAlbert, DHMagoc, TJNagy, IBMarcotte, PALi, JMorgan, DWHutchins, CSummers, JB The design, synthesis, and structure-activity relationships of a series of macrocyclic MMP inhibitors. Bioorg Med Chem Lett 8:2087-92 (1999)  
Target
Name:
72 kDa type IV collagenase
Synonyms:
72 kDa gelatinase CLG4A Gelatinase A (MMP-2) MMP2_HUMAN Matrix metalloproteinase-2 (MMP 2) Matrix metalloproteinases 2 (MMP-2) | TBE-1
Type:
Enzyme
Mol. Mass.:
73870.36
Organism:
Homo sapiens (Human)
Description:
P08253
Residue:
660
  
Inhibitor
Name:
BDBM50071267
Synonyms:
(7S,8R,11S)-9-Oxo-8-[2-(4-propyl-phenyl)-ethyl]-2-oxa-10-aza-bicyclo[11.2.2]heptadeca-1(16),13(17),14-triene-7,11-dicarboxylic acid 7-hydroxyamide 11-methylamide | CHEMBL418291
Type:
Small organic molecule
Emp. Form.:
C29H39N3O5
Mol. Mass.:
509.6371
SMILES:
CCCc1ccc(CC[C@@H]2[C@H](CCCCOc3ccc(C[C@H](NC2=O)C(=O)NC)cc3)C(=O)NO)cc1
: