Target
Proteasome subunit beta type-5
Ligand
BDBM50516759
Substrate
Meas. Tech.
ChEMBL_1866705 (CHEMBL4367680)
Ki
17±n/a nM
Citation
 Fernandes, GFSDenny, WADos Santos, JL Boron in drug design: Recent advances in the development of new therapeutic agents. Eur J Med Chem 179:791-804 (2019)  
Target
Name:
Proteasome subunit beta type-5
Synonyms:
20S proteasome chymotrypsin-like LMPX PSB5_HUMAN Proteasome Macropain subunit MB1 X
Type:
Protein
Mol. Mass.:
28480.96
Organism:
Homo sapiens (Human)
Description:
Residue:
263
  
Inhibitor
Name:
BDBM50516759
Synonyms:
CHEMBL4458610
Type:
Small organic molecule
Emp. Form.:
C21H30BN3O4
Mol. Mass.:
399.292
SMILES:
CCc1cccc(Nc2ccn(CCC(=O)N[C@@H](CC(C)C)B(O)O)c(=O)c2)c1
: